name,code,total,translated,translated_percent,translated_words_percent,total_words,translated_words,total_chars,translated_chars,translated_chars_percent,failing,failing_percent,fuzzy,fuzzy_percent,url_translate,url,translate_url,last_change,last_author,recent_changes,readonly,readonly_percent,approved,approved_percent,suggestions,comments
Catalan,ca,39,0,0.0,0.0,950,0,6680,0,0.0,0,0.0,0,0.0,,https://translate.fedoraproject.org/projects/fedora-docs-l10n-fedora-install-guide/f26pagesadvancedkickstart_installations/ca/,https://translate.fedoraproject.org/translate/fedora-docs-l10n-fedora-install-guide/f26pagesadvancedkickstart_installations/ca/,,,0,0,0.0,0,0.0,0,0
Czech,cs,39,0,0.0,0.0,950,0,6680,0,0.0,0,0.0,0,0.0,,https://translate.fedoraproject.org/projects/fedora-docs-l10n-fedora-install-guide/f26pagesadvancedkickstart_installations/cs/,https://translate.fedoraproject.org/translate/fedora-docs-l10n-fedora-install-guide/f26pagesadvancedkickstart_installations/cs/,,,0,0,0.0,0,0.0,0,0
German,de,39,0,0.0,0.0,950,0,6680,0,0.0,0,0.0,0,0.0,,https://translate.fedoraproject.org/projects/fedora-docs-l10n-fedora-install-guide/f26pagesadvancedkickstart_installations/de/,https://translate.fedoraproject.org/translate/fedora-docs-l10n-fedora-install-guide/f26pagesadvancedkickstart_installations/de/,,,0,0,0.0,0,0.0,0,0
English,en,39,39,100.0,100.0,950,950,6680,6680,100.0,2,5.1,0,0.0,,https://translate.fedoraproject.org/projects/fedora-docs-l10n-fedora-install-guide/f26pagesadvancedkickstart_installations/en/,https://translate.fedoraproject.org/translate/fedora-docs-l10n-fedora-install-guide/f26pagesadvancedkickstart_installations/en/,,,0,39,100.0,0,0.0,0,0
Spanish,es,39,0,0.0,0.0,950,0,6680,0,0.0,0,0.0,0,0.0,,https://translate.fedoraproject.org/projects/fedora-docs-l10n-fedora-install-guide/f26pagesadvancedkickstart_installations/es/,https://translate.fedoraproject.org/translate/fedora-docs-l10n-fedora-install-guide/f26pagesadvancedkickstart_installations/es/,,,0,0,0.0,0,0.0,9,0
Finnish,fi,39,1,2.5,0.5,950,5,6680,42,0.6,0,0.0,0,0.0,,https://translate.fedoraproject.org/projects/fedora-docs-l10n-fedora-install-guide/f26pagesadvancedkickstart_installations/fi/,https://translate.fedoraproject.org/translate/fedora-docs-l10n-fedora-install-guide/f26pagesadvancedkickstart_installations/fi/,2024-01-11 08:39:11.737553+00:00,,1,0,0.0,0,0.0,37,0
French,fr,39,33,84.6,75.6,950,719,6680,4595,68.7,2,5.1,0,0.0,,https://translate.fedoraproject.org/projects/fedora-docs-l10n-fedora-install-guide/f26pagesadvancedkickstart_installations/fr/,https://translate.fedoraproject.org/translate/fedora-docs-l10n-fedora-install-guide/f26pagesadvancedkickstart_installations/fr/,2024-01-10 17:29:41.407608+00:00,,4,0,0.0,0,0.0,5,0
Friulian,fur,39,0,0.0,0.0,950,0,6680,0,0.0,0,0.0,0,0.0,,https://translate.fedoraproject.org/projects/fedora-docs-l10n-fedora-install-guide/f26pagesadvancedkickstart_installations/fur/,https://translate.fedoraproject.org/translate/fedora-docs-l10n-fedora-install-guide/f26pagesadvancedkickstart_installations/fur/,2023-12-29 12:51:06.439951+00:00,,0,0,0.0,0,0.0,38,0
Indonesian,id,39,0,0.0,0.0,950,0,6680,0,0.0,0,0.0,0,0.0,,https://translate.fedoraproject.org/projects/fedora-docs-l10n-fedora-install-guide/f26pagesadvancedkickstart_installations/id/,https://translate.fedoraproject.org/translate/fedora-docs-l10n-fedora-install-guide/f26pagesadvancedkickstart_installations/id/,,,0,0,0.0,0,0.0,39,0
Italian,it,39,0,0.0,0.0,950,0,6680,0,0.0,0,0.0,0,0.0,,https://translate.fedoraproject.org/projects/fedora-docs-l10n-fedora-install-guide/f26pagesadvancedkickstart_installations/it/,https://translate.fedoraproject.org/translate/fedora-docs-l10n-fedora-install-guide/f26pagesadvancedkickstart_installations/it/,,,0,0,0.0,0,0.0,0,0
Japanese,ja,39,0,0.0,0.0,950,0,6680,0,0.0,0,0.0,0,0.0,,https://translate.fedoraproject.org/projects/fedora-docs-l10n-fedora-install-guide/f26pagesadvancedkickstart_installations/ja/,https://translate.fedoraproject.org/translate/fedora-docs-l10n-fedora-install-guide/f26pagesadvancedkickstart_installations/ja/,,,0,0,0.0,0,0.0,0,0
Korean,ko,39,28,71.7,34.3,950,326,6680,2209,33.0,0,0.0,0,0.0,,https://translate.fedoraproject.org/projects/fedora-docs-l10n-fedora-install-guide/f26pagesadvancedkickstart_installations/ko/,https://translate.fedoraproject.org/translate/fedora-docs-l10n-fedora-install-guide/f26pagesadvancedkickstart_installations/ko/,2024-02-26 06:43:17.135339+00:00,,6,0,0.0,0,0.0,0,0
Dutch,nl,39,0,0.0,0.0,950,0,6680,0,0.0,0,0.0,0,0.0,,https://translate.fedoraproject.org/projects/fedora-docs-l10n-fedora-install-guide/f26pagesadvancedkickstart_installations/nl/,https://translate.fedoraproject.org/translate/fedora-docs-l10n-fedora-install-guide/f26pagesadvancedkickstart_installations/nl/,,,0,0,0.0,0,0.0,0,0
Portuguese (Brazil),pt_BR,39,0,0.0,0.0,950,0,6680,0,0.0,0,0.0,0,0.0,,https://translate.fedoraproject.org/projects/fedora-docs-l10n-fedora-install-guide/f26pagesadvancedkickstart_installations/pt_BR/,https://translate.fedoraproject.org/translate/fedora-docs-l10n-fedora-install-guide/f26pagesadvancedkickstart_installations/pt_BR/,,,0,0,0.0,0,0.0,39,0
Russian,ru,39,0,0.0,0.0,950,0,6680,0,0.0,0,0.0,0,0.0,,https://translate.fedoraproject.org/projects/fedora-docs-l10n-fedora-install-guide/f26pagesadvancedkickstart_installations/ru/,https://translate.fedoraproject.org/translate/fedora-docs-l10n-fedora-install-guide/f26pagesadvancedkickstart_installations/ru/,,,0,0,0.0,0,0.0,0,0
Sinhala,si,39,0,0.0,0.0,950,0,6680,0,0.0,0,0.0,0,0.0,,https://translate.fedoraproject.org/projects/fedora-docs-l10n-fedora-install-guide/f26pagesadvancedkickstart_installations/si/,https://translate.fedoraproject.org/translate/fedora-docs-l10n-fedora-install-guide/f26pagesadvancedkickstart_installations/si/,2023-12-29 12:51:08.902688+00:00,,0,0,0.0,0,0.0,0,0
Swahili,sw,39,0,0.0,0.0,950,0,6680,0,0.0,0,0.0,0,0.0,,https://translate.fedoraproject.org/projects/fedora-docs-l10n-fedora-install-guide/f26pagesadvancedkickstart_installations/sw/,https://translate.fedoraproject.org/translate/fedora-docs-l10n-fedora-install-guide/f26pagesadvancedkickstart_installations/sw/,2023-12-29 12:51:09.192889+00:00,,0,0,0.0,0,0.0,0,0
Turkish,tr,39,0,0.0,0.0,950,0,6680,0,0.0,0,0.0,0,0.0,,https://translate.fedoraproject.org/projects/fedora-docs-l10n-fedora-install-guide/f26pagesadvancedkickstart_installations/tr/,https://translate.fedoraproject.org/translate/fedora-docs-l10n-fedora-install-guide/f26pagesadvancedkickstart_installations/tr/,2023-12-29 12:51:09.477814+00:00,,0,0,0.0,0,0.0,39,0
Ukrainian,uk,39,0,0.0,0.0,950,0,6680,0,0.0,0,0.0,0,0.0,,https://translate.fedoraproject.org/projects/fedora-docs-l10n-fedora-install-guide/f26pagesadvancedkickstart_installations/uk/,https://translate.fedoraproject.org/translate/fedora-docs-l10n-fedora-install-guide/f26pagesadvancedkickstart_installations/uk/,,,0,0,0.0,0,0.0,0,0
Urdu (Pakistan),ur_PK,39,0,0.0,0.0,950,0,6680,0,0.0,0,0.0,0,0.0,,https://translate.fedoraproject.org/projects/fedora-docs-l10n-fedora-install-guide/f26pagesadvancedkickstart_installations/ur_PK/,https://translate.fedoraproject.org/translate/fedora-docs-l10n-fedora-install-guide/f26pagesadvancedkickstart_installations/ur_PK/,2023-12-29 12:51:10.033801+00:00,,0,0,0.0,0,0.0,0,0
Chinese (Simplified),zh_Hans,39,0,0.0,0.0,950,0,6680,0,0.0,0,0.0,0,0.0,,https://translate.fedoraproject.org/projects/fedora-docs-l10n-fedora-install-guide/f26pagesadvancedkickstart_installations/zh_Hans/,https://translate.fedoraproject.org/translate/fedora-docs-l10n-fedora-install-guide/f26pagesadvancedkickstart_installations/zh_Hans/,2023-12-29 12:51:10.301978+00:00,,0,0,0.0,0,0.0,39,0
Chinese (Traditional),zh_Hant,39,0,0.0,0.0,950,0,6680,0,0.0,0,0.0,0,0.0,,https://translate.fedoraproject.org/projects/fedora-docs-l10n-fedora-install-guide/f26pagesadvancedkickstart_installations/zh_Hant/,https://translate.fedoraproject.org/translate/fedora-docs-l10n-fedora-install-guide/f26pagesadvancedkickstart_installations/zh_Hant/,,,0,0,0.0,0,0.0,0,0
